{"text_format":"1","workbook":"xlsx","n_sheets":8,"sheets":["1-Project Desc","2-Crashes","3-ROR Worksheet","4-RSI Calculations Worksheet","5-Scoring Worksheet","CRF Table_Rev","Scoring Table","RefTables"],"not_rendered":{"charts":0,"images":6,"macros":1,"external_links":0,"defined_names":40,"comments":1,"pivot_tables":0},"unopened":[],"bounds":{"document_bytes":16777216,"sheet_cells":100000,"rows_first":2000,"rows_last":500,"rows_between":2000,"halvings":0,"cell_chars":16384,"cell_head_chars":4096},"cells_cut":0,"cells_raw":0,"read":"whole","date_system":"1900"}

{"sheet":"1-Project Desc","index":0,"n_rows":95,"n_cols":13,"rows_kept":95,"cut":false,"hidden":false,"merged":[[41,2,41,5],[32,0,32,4],[33,0,33,4],[86,2,86,3],[80,1,80,4],[81,1,81,4],[82,1,82,4],[83,1,83,4],[70,0,78,5],[59,0,67,5],[40,0,40,1],[41,0,41,1],[40,2,40,5],[39,0,39,5]]}
[]
["HSIP FUNDING APPLICATION"]
[]
[null,{"$f":"IF(B10=\"\",\"\",CONCATENATE(B10,\" - \",'3-ROR Worksheet'!K4)&IF('3-ROR Worksheet'!K5=\"\",CONCATENATE(\"; \",'3-ROR Worksheet'!S4,\" to \",'3-ROR Worksheet'!X4),CONCATENATE(\" at \",'3-ROR Worksheet'!K5)))","v":""}]
["Page 1"]
[]
["DATE"]
[null,null,null,null,null,null,null,null,null,"Adams County",null,"Local Let"]
["Project Information:",null,null,null,null,null,null,null,null,"Allen County",null,"ODOT Let"]
["COUNTY",null,null,null,null,null,null,null,null,"Ashland County"]
{"$rows_left_out":86}
{"sheet":"2-Crashes","index":1,"n_rows":20,"n_cols":94,"rows_kept":20,"cut":false,"hidden":false,"merged":[[18,91,18,92],[18,75,18,76],[18,77,18,78],[18,79,18,80],[18,81,18,82],[18,83,18,84],[18,85,18,86],[17,61,17,66],[17,67,17,72],[17,73,17,92],[18,61,18,62],[18,63,18,64],[18,65,18,66],[18,67,18,68],[18,69,18,70],[18,71,18,72],[18,73,18,74],[18,87,18,88],[18,89,18,90]]}
["County: ",{"$f":"'3-ROR Worksheet'!$C$4","v":0},"Main Roadway: ",{"$f":"'3-ROR Worksheet'!$K$4","v":0},"Begin SLM:",{"$f":"'3-ROR Worksheet'!$S$4","v":0},"End SLM: ",{"$f":"'3-ROR Worksheet'!$X$4","v":""},null,null,null,null,null,null,null,null,null,null,null,null,{"$f":"IF(BK1=\"\",\"\",HYPERLINK(BK1,\"Crash Report\"))","v":""},{"$f":"IF(BL1=\"\",\"\",HYPERLINK(BL1,\"Crash Report\"))","v":""}]
[null,null,"Intersecting Roadway: ",{"$f":"'3-ROR Worksheet'!$K$5","v":""},null,null,null,null,null,null,null,null,null,null,null,null,null,null,null,null,"",""]
["Prepared by : ",{"$f":"'3-ROR Worksheet'!$C$6","v":""},"Date:",{"$f":"IF('1-Project Desc'!B7<>0,'1-Project Desc'!B7,\"\")","v":""},"Crash Bdate:",{"$f":"'3-ROR Worksheet'!$S$6","v":"00:00:00"},"Crash Edate: ",{"$f":"'3-ROR Worksheet'!$X$6","v":"00:00:00"},null,null,null,null,null,null,null,null,null,null,null,null,"",""]
[null,null,null,null,null,null,null,null,null,null,null,null,null,null,null,null,null,null,null,null,"",""]
[null,null,null,null,null,null,null,null,null,null,null,null,null,null,null,null,null,null,null,null,"",""]
[null,null,null,null,null,null,null,null,null,null,null,null,null,null,null,null,null,null,null,null,"",""]
[null,null,null,null,null,null,null,null,null,null,null,null,null,null,null,null,null,null,null,null,"",""]
[null,null,null,null,null,null,null,null,null,null,null,null,null,null,null,null,null,null,null,null,"",""]
[null,null,null,null,null,null,null,null,null,null,null,null,null,null,null,null,null,null,null,null,"",""]
[null,null,null,null,null,null,null,null,null,null,null,null,null,null,null,null,null,null,null,null,"",""]
{"$rows_left_out":11}
{"sheet":"3-ROR Worksheet","index":2,"n_rows":89,"n_cols":78,"rows_kept":89,"cut":false,"hidden":false,"merged":[[8,15,8,16],[23,19,23,20],[31,19,31,20],[27,19,27,20],[21,12,21,13],[22,12,22,13],[23,12,23,13],[8,11,8,12],[25,1,25,11],[26,12,26,13],[22,19,22,20],[20,12,20,13],[20,0,20,11],[20,14,20,22],[8,13,8,14],[8,3,8,4],[28,19,28,20],[8,17,8,18],[26,19,26,20],[25,12,25,13],[24,19,24,20],[25,19,25,20],[24,12,24,13],[27,12,27,13],[32,28,32,30],[32,31,32,32],[31,28,31,30],[30,28,30,30],[29,21,29,22],[33,19,33,20],[29,31,29,32],[29,28,29,30],[32,21,32,22],[33,31,33,32],[0,0,0,32],[7,1,7,6],[7,7,7,12],[3,2,3,5],[5,2,5,5],[5,23,5,25],[7,13,7,32],[5,18,5,20],[3,10,3,15],[4,10,4,15],[5,7,5,9],[3,18,3,20],[3,23,3,25],[24,31,24,32],[26,21,26,22],[27,21,27,22],[32,19,32,20],[31,31,31,32],[30,21,30,22],[24,21,24,22],[8,33,8,34],[28,21,28,22],[22,21,22,22],[23,21,23,22],[25,21,25,22],[8,31,8,32],[26,31,26,32],[27,31,27,32],[8,25,8,26],[21,28,21,30],[22,28,22,30],[23,28,23,30],[24,28,24,30],[25,28,25,30],[26,28,26,30],[27,28,27,30],[23,31,23,32],[28,31,28,32],[22,31,22,32],[25,31,25,32],[28,28,28,30],[20,23,20,32],[46,24,46,26],[46,28,46,30],[39,26,39,27],[40,16,40,19],[40,23,40,24],[40,26,40,27],[43,28,43,30],[42,0,42,32],[39,20,39,21],[39,23,39,24],[31,21,31,22],[40,0,40,4],[39,16,39,19],[21,1,21,11],[22,1,22,11],[36,21,36,22],[28,12,28,13],[30,12,30,13],[29,12,29,13],[51,0,51,9],[51,10,51,12],[49,0,49,9],[43,21,43,22],[44,21,44,22],[46,21,46,22],[49,17,49,19],[50,17,50,19],[51,17,51,19],[43,14,43,19],[50,0,50,9],[50,21,50,24],[48,0,48,32],[44,24,44,26],[49,10,49,12],[50,10,50,12],[45,28,45,30],[44,28,44,30],[43,24,43,26],[7,33,7,34],[38,6,38,7],[8,29,8,30],[8,9,8,10],[8,7,8,8],[8,5,8,6],[8,27,8,28],[8,21,8,22],[30,19,30,20],[8,19,8,20],[23,1,23,11],[24,1,24,11],[30,31,30,32],[37,0,37,32],[38,0,38,4],[36,14,36,20],[36,23,36,30],[26,0,36,11],[35,12,35,13],[34,12,34,13],[36,31,36,32],[33,28,33,30],[8,23,8,24],[8,1,8,2],[32,12,32,13],[40,20,40,21],[39,0,39,4],[40,6,40,7],[39,6,39,7],[33,21,33,22],[29,19,29,20],[33,12,33,13],[31,12,31,13]]}
["RATE OF RETURN - ECONOMIC ANALYSIS WORKSHEET"]
[]
["Cells in Green Require User Review"]
["County",null,{"$f":"'1-Project Desc'!B10","v":0},null,null,null,"Main Roadway",null,null,null,{"$f":"IF('1-Project Desc'!B12=\"Section\",'1-Project Desc'!B16,'1-Project Desc'!B29)","v":0},null,null,null,null,null,"Begin SLM",null,{"$f":"IF('1-Project Desc'!B12=\"Section\",'1-Project Desc'!B17,'1-Project Desc'!B30)","v":0},null,null,"End SLM",null,{"$f":"IF('1-Project Desc'!B12=\"Section\",'1-Project Desc'!B18,\"\")","v":""}]
[null,null,null,null,null,null,"Intersecting Roadway",null,null,null,{"$f":"IF('1-Project Desc'!B12=\"Section\",\"\",IF('1-Project Desc'!D29<>0,'1-Project Desc'!D29,\"\")&IF('1-Project Desc'!E29<>0,IF('1-Project Desc'!E29='1-Project Desc'!D29,\"\",\" / \"&'1-Project Desc'!E29),\"\")&IF('1-Project Desc'!F29<>0,IF('1-Project Desc'!F29='1-Project Desc'!E29,\"\",\" / \"&'1-Project Desc'!F29),\"\"))","v":""}]
["Prepared by ",null,{"$f":"IF('1-Project Desc'!C87<>0,'1-Project Desc'!C87,\"\")","v":""},null,null,null,"Date",{"$f":"IF('1-Project Desc'!B7<>0,'1-Project Desc'!B7,\"\")","v":""},null,null,null,null,null,null,null,null,"Crash BDate",null,null,null,null,"Crash EDate"]
[]
["Year","TIME OF DAY",null,null,null,null,null,"ROADWAY CONDITION",null,null,null,null,null,"CRASH TYPE"]
[null,"DAY",null,"DAWN/DUSK",null,"DARK",null,"DRY",null,"WET",null,"SNOW / ICE",null,"REAR END",null,"LEFT",null,"RIGHT",null,"ANGLE",null,"HEAD ON",null,"SS PASS",null,"FIXED OBJ",null,"RAN OFF RD",null,"PEDESTRIAN",null,"OTHER",null,"TOTAL"]
[null,"PDO","I/F","PDO","I/F","PDO","I/F","PDO","I/F","PDO","I/F","PDO","I/F","PDO","I/F","PDO","I/F","PDO","I/F","PDO","I/F","PDO","I/F","PDO","I/F","PDO","I/F","PDO","I/F","PDO","I/F","PDO","I/F","PDO","I/F"]
{"$rows_left_out":80}
{"sheet":"4-RSI Calculations Worksheet","index":3,"n_rows":33,"n_cols":8,"rows_kept":33,"cut":false,"hidden":false,"merged":[[10,1,10,5],[8,4,8,6]]}
[]
["HSIP FUNDING APPLICATION"]
["Page 4"]
[]
["County: ",{"$f":"'3-ROR Worksheet'!$C$4","v":0},"Main Roadway: ",{"$f":"'3-ROR Worksheet'!$K$4","v":0},"Begin SLM:",{"$f":"'3-ROR Worksheet'!$S$4","v":0},"End SLM: ",{"$f":"'3-ROR Worksheet'!$X$4","v":""}]
[null,null,"Intersecting Roadway: ",{"$f":"'3-ROR Worksheet'!$K$5","v":""}]
["Prepared by : ",{"$f":"'3-ROR Worksheet'!$C$6","v":""},"Date:",{"$f":"IF('1-Project Desc'!B7<>0,'1-Project Desc'!B7,\"\")","v":""},"Crash Bdate:",{"$f":"'3-ROR Worksheet'!$S$6","v":"00:00:00"},"Crash Edate: ",{"$f":"'3-ROR Worksheet'!$X$6","v":"00:00:00"}]
[]
[null,"RSI Value = ",{"$f":"IF(ISERROR(D33/(C33)),VALUE(0),D33/(C33))","v":0},null,"Cells in Green Require User Review"]
[]
{"$rows_left_out":24}
{"sheet":"5-Scoring Worksheet","index":4,"n_rows":52,"n_cols":43,"rows_kept":52,"cut":false,"hidden":false,"merged":[[3,3,3,4],[4,3,4,4],[23,0,23,7],[10,2,10,3],[33,0,33,1],[25,0,25,1],[25,4,25,5],[25,2,25,3],[29,0,29,1],[29,2,29,3],[33,2,33,3],[38,18,38,21],[29,5,31,5],[29,6,31,6],[39,18,39,19],[39,20,39,21],[33,4,33,5]]}
[]
["HSIP FUNDING APPLICATION"]
["Page 5"]
["County: ",{"$f":"'3-ROR Worksheet'!$C$4","v":0},"Main Roadway: ",{"$f":"'3-ROR Worksheet'!$K$4","v":0},null,"Begin SLM:",{"$f":"'3-ROR Worksheet'!$S$4","v":0},"End SLM: ",{"$f":"'3-ROR Worksheet'!$X$4","v":""}]
[null,null,"Intersecting Roadway: ",{"$f":"IF('3-ROR Worksheet'!$K$5=0,\"\",'3-ROR Worksheet'!$K$5)","v":""}]
["Prepared by : ",{"$f":"'3-ROR Worksheet'!$C$6","v":""},"Date:",{"$f":"IF('1-Project Desc'!B7<>0,'1-Project Desc'!B7,\"\")","v":""},null,"Crash Bdate:",{"$f":"'3-ROR Worksheet'!$S$6","v":"00:00:00"},"Crash Edate: ",{"$f":"'3-ROR Worksheet'!$X$6","v":"00:00:00"}]
[]
[]
[]
[]
{"$rows_left_out":43}
{"sheet":"CRF Table_Rev","index":5,"n_rows":150,"n_cols":39,"rows_kept":150,"cut":false,"hidden":false,"merged":[[1,14,3,25],[1,27,3,38],[0,4,2,5]]}
["Estimates of Countermeasure Effectiveness Reduction (CRF) Factors",null,null,null,"Find Addiational Countermeasures Here:"]
[null,null,null,null,null,null,null,null,null,null,null,null,null,null,"Property Damage Only Crashes",null,null,null,null,null,null,null,null,null,null,null,null,"Injury / Fatal Crashes"]
[]
[]
["CMF ID","Study Title","Countermeasure Category","Countermeasure","Service Life","Intersection Related (Y/N)","Wet Pavement Related","Night Related","Ran off Road","Publication Year","Star Quality Rating","All","PDO","INJ/FAT","Night","WET","RAN OFF RD","LEFT","RIGHT","ANGLE","REAR END","HEAD ON","SS PASS","FIXED OBJ","PEDESTRIAN","OTHER",{"$f":"D5","v":"Countermeasure"},"Night","WET","RAN OFF RD","LEFT","RIGHT","ANGLE","REAR END","HEAD ON","SS PASS","FIXED OBJ","PEDESTRIAN","OTHER"]
[22,"Handbook of Road Safety Measures","Access management","Provide a median - Urban",20,null,null,null,null,2004,4,null,-0.09,0.39,null,null,null,{"$f":"$M6","v":-0.09},-0.09,-0.09,-0.09,-0.09,-0.09,-0.09,-0.09,-0.09,{"$f":"D6","v":"Provide a median - Urban"},null,null,null,{"$f":"$N6","v":0.39},0.39,0.39,0.39,0.39,0.39,0.39,0.39,0.39]
[24,"Handbook of Road Safety Measures","Access management","Provide a median - Rural",20,null,null,null,null,2004,4,null,0.18,0.12,null,null,null,0.18,0.18,0.18,0.18,0.18,0.18,0.18,0.18,0.18,"Provide a median - Rural",null,null,null,0.12,0.12,0.12,0.12,0.12,0.12,0.12,0.12,0.12]
[2514,"Modeling and Evaluating the Safety Impacts of Access Management (AM) Features in the Las Vegas Valley","Access management","Replace TWLTL with raised median - Urban Only",20,null,null,null,"Yes",2010,3,null,null,null,null,null,0.33,0.36,null,0.36,0.19,0.47,0.21,0.33,null,null,"Replace TWLTL with raised median - Urban Only",null,null,0.33,0.36,null,0.36,0.19,0.47,0.21,0.21]
[3034,"Analyzing Raised Median Safety Impacts Using Bayesian Methods","Access management","Install raised median",20,null,null,null,null,2011,4,0.39,null,0.44,null,null,null,{"$f":"$L9","v":0.39},0.39,0.39,0.39,0.39,0.39,0.39,0.39,0.39,"Install raised median",null,null,null,{"$f":"$N9","v":0.44},0.44,0.44,0.44,0.44,0.44,0.44,0.44,0.44]
[78,"Handbook of Road Safety Measures","Advanced technology and ITS","Install changeable speed warning signs for individual drivers",5,"Yes",null,null,null,2004,4,0.46,null,null,null,null,null,0.46,0.46,0.46,0.46,0.46,0.46,0.46,0.46,0.46,"Install changeable speed warning signs for individual drivers",null,null,null,{"$f":"$L10","v":0.46},0.46,0.46,0.46,0.46,0.46,0.46,0.46,0.46]
{"$rows_left_out":141}
{"sheet":"Scoring Table","index":6,"n_rows":14,"n_cols":12,"rows_kept":14,"cut":false,"hidden":false,"merged":[[1,0,1,7],[0,0,0,11],[1,8,1,11]]}
["Safety Project Scoring Matrix"]
["Safety Conditions",null,null,null,null,null,null,null,"Economic Analysis"]
["Crash Rate (Intersection)","Points","Crash Rate (Section)","Points","RSI","Points","EPDO Value","Points","HSIP Funding Request","Points","Rate of Return (%)","Points"]
[">=10",20,">=10",20,">= 60,000",20,">= 250",20,"< $400,000",20,">=20",20]
["9 to 9.99",18,"9 to 9.99",18,"55000 to 60000",18,"225 to 250",18,"$400,000 to $800,000",15,"18 to 20",18]
["8 to 8.99",16,"8 to 8.99",16,"50000 to 55000",16,"200 to 225",16,"$800,000 to $1,200,000",10,"16 to 18",16]
["7 to 7.99",14,"7 to 7.99",14,"47500 to 50000",14,"175 to 200",14,"$1,200,000 to $1,600,000",5,"14 to 16",14]
["6 to 6.99",12,"6 to 6.99",12,"45000 to 47500",12,"150 to 175",12,">= $1,600,000",0,"12 to 14",12]
["5 to 5.99",10,"5 to 5.99",10,"42500 to 45000",10,"125 to 150",10,null,null,"10 to 12",10]
["4 to 4.99",8,"4 to 4.99",8,"40000 to 42500",8,"100 to 125",8,null,null,"8 to 10",8]
{"$rows_left_out":5}
{"sheet":"RefTables","index":7,"n_rows":32,"n_cols":1,"rows_kept":32,"cut":false,"hidden":true,"merged":[]}
["Ohio SHSP Emphasis Area"]
["Serious Crash Types"]
["High Risk Drivers and Behaviors"]
["Special Vehicles and Roadway Users"]
["Data"]
[]
[]
["Data"]
["Timely Data"]
["Reliable Data"]
{"$rows_left_out":22}